{"text_format":"1","workbook":"xlsx","n_sheets":8,"sheets":["Work Orders","Parcels","Relo Schedule Phase 1","Relo Schedule Phase 2","Example Parcels","Example","Appendix","Guidance"],"not_rendered":{"charts":0,"images":5,"macros":1,"external_links":0,"defined_names":5,"comments":3,"pivot_tables":0},"unopened":[],"bounds":{"document_bytes":16777216,"sheet_cells":100000,"rows_first":2000,"rows_last":500,"rows_between":2000,"halvings":0,"cell_chars":16384,"cell_head_chars":4096},"cells_cut":0,"cells_raw":0,"read":"whole","date_system":"1900"}

{"sheet":"Work Orders","index":0,"n_rows":9,"n_cols":20,"rows_kept":9,"cut":false,"hidden":true,"merged":[[6,0,8,0],[6,1,8,1],[6,2,8,2],[0,0,0,17],[1,3,1,12],[2,0,4,0],[2,1,4,1],[2,2,4,2]]}
["TIP No. X-XXXX Utility Priority Parcels"]
["Duke Work Order","UbO Sheet","Station Range",null,null,null,null,null,null,null,null,null,null,null,"Acquired","Total","% Complete"]
[1,"UO-2 - UO-8","10+00 - 100+00",2,5,6,12,13,14,15,16,17,18]
[null,null,null,19,23,24,25,26,27,28,29,30,31,null,26,27,{"$f":"O4/P4","v":0.96296296296296291},null,null,"Waiting to be recorded"]
[null,null,null,32,33,34,35,38,72,73,null,null,null,null,null,null,null,null,null,"Initial Contact"]
[null,null,null,null,null,null,null,null,null,null,null,null,null,null,null,null,null,null,null,"On Hold"]
[2,"UO-9 - UO-15","100+00 - 162+00",40,41,42,43,44,45,46,47,48,49,null,null,null,null,null,null,"Condemnation"]
[null,null,null,50,51,54,55,56,57,58,63,64,66,null,24,28,{"$f":"O8/P8","v":0.8571428571428571},null,null,"Filed"]
[null,null,null,67,68,69,70,71,74,75,77]

{"sheet":"Parcels","index":1,"n_rows":1010,"n_cols":32,"rows_kept":1010,"cut":false,"hidden":false,"merged":[[14,0,15,3],[7,5,7,8]]}
["Legend",null,"Acquired",null,null,null,null,null,null,null,null,null,null,null,null,null,null,null,null,null,null,null,null,null,null,null,null,null,null,null,"Acquired","Hidden"]
[null,null,"Waiting to be recorded",null,null,null,null,null,null,null,null,null,null,null,null,null,null,null,null,null,null,null,null,null,null,null,null,null,null,null,"Waiting to be recorded"]
[null,null,"Initial Contact",null,null,null,null,null,null,null,null,null,null,null,null,null,null,null,null,null,null,null,null,null,null,null,null,null,null,null,"Initial Contact"]
[null,null,"On Hold",null,null,null,null,null,null,null,null,null,null,null,null,null,null,null,null,null,null,null,null,null,null,null,null,null,null,null,"On Hold"]
[null,null,"Condemnation",null,null,null,null,null,null,null,null,null,null,null,null,null,null,null,null,null,null,null,null,null,null,null,null,null,null,null,"Condemnation"]
[null,null,"Filed",null,null,null,null,null,null,null,null,null,null,null,null,null,null,null,null,null,null,null,null,null,null,null,null,null,null,null,"Filed"]
[null,null,null,null,null,"Replace \"Utility Owner #\" with actual Utility Owner names"]
["Acquired","Total","% of Parcels Acquired","Acquired Date",null,"If Utility owner is on parcel select them from dropdown"]
[{"$f":"COUNTIF(G11:G1010, \"Acquired\")+COUNTIF(G11:G1010, \"Filed\")","v":0},{"$f":"SUMPRODUCT(--(MMULT(--(I11:X1010<>\"\"),TRANSPOSE(COLUMN(I11:X11)^0))>0))","v":0},{"$f":"IF(B9=0,\"\",A9/B9)","v":""}]
[null,null,null,null,null,"Date Acquired","Status","Parcel #","Utility Owner 1","Utility owner 2","Utility owner 3","Utility owner 4","Utility owner 5","Utility owner 6","Utility owner 7","Utility owner 8","Utility owner 9","Utility owner 10","Utility owner 11","Utility owner 12","Utility owner 13","Utility owner 14","Utility owner 15","Backflow Preventer"]
{"$rows_left_out":1001}
{"sheet":"Relo Schedule Phase 1","index":2,"n_rows":92,"n_cols":101,"rows_kept":92,"cut":false,"hidden":false,"merged":[[4,2,4,3],[4,5,4,6],[4,7,4,8],[0,3,0,4],[0,5,0,6],[1,11,1,17],[2,11,3,17],[3,2,3,3],[11,15,11,87],[5,0,5,2],[5,4,5,6],[5,11,5,17],[6,0,6,1],[6,11,7,17],[9,0,9,6],[9,7,9,14],[10,1,11,6],[10,7,11,9],[10,10,11,10],[10,11,11,13],[10,14,11,14],[32,39,32,40],[32,15,32,16],[32,17,32,18],[32,19,32,20],[32,21,32,22],[32,23,32,24],[32,25,32,28],[32,29,32,30],[32,31,32,32],[32,33,32,34],[32,35,32,36],[32,37,32,38],[32,63,32,66],[32,67,32,68],[32,41,32,42],[32,43,32,44],[32,45,32,48],[32,49,32,50],[32,51,32,52],[32,53,32,54],[32,83,32,84],[32,85,32,86],[44,25,44,29],[44,45,44,49],[44,63,44,67],[44,79,44,83],[32,69,32,70],[32,71,32,72],[32,73,32,74],[32,75,32,76],[32,77,32,78],[32,79,32,82],[32,55,32,56],[32,57,32,58],[32,59,32,60],[32,61,32,62],[80,64,80,65],[80,80,80,81],[59,4,59,5],[59,11,59,12],[80,9,80,10],[80,13,80,14],[80,27,80,28],[80,47,80,48]]}
[null,"Enter in the highlighted fields",null,"NCDOT Reviewer:",null,null,null,null,null,"V2.0"]
["Let Date:",null,"TIP #:",null,"County:",null,"Division:",{"$f":"IF(F2=\"\",\"\",VLOOKUP(F2,Guidance!B85:C183,2,FALSE))","v":""},null,null,null,"Project Description:"]
[]
["PS&E Date:",null,"Utility Priority Parcels Aquired Date:"]
["Date final PUE due from PEF to DOT:",null,"Date final PUE sent to DOT:",null,null,"PUE received date compared to PUE due date:",null,{"$f":"IF(B5=\"\",\"\",\nIF(E5=B5,\"On time\",\nIF(E5>B5,\n   IF(DATEDIF(B5,E5,\"d\")<=30, DATEDIF(B5,E5,\"d\") & \" days behind schedule\", DATEDIF(B5,E5,\"m\") & \" months behind schedule\"),\n   IF(DATEDIF(E5,B5,\"d\")<=30, DATEDIF(E5,B5,\"d\") & \" days ahead of schedule\", DATEDIF(E5,B5,\"m\") & \" months ahead of schedule\")\n)))","v":""},null,{"$f":"DATEDIF(MIN(B5,E5), MAX(B5,E5), \"m\") * SIGN(E5 - B5)","v":"00:00:00"},null,null,null,null,null,null,null,null,null,null,null,null,null,null,null,null,null,null,null,null,null,null,null,null,null,null,null,null,null,null,null,null,null,null,null,null,null,null,null,null,null,null,null,null,null,null,null,null,null,null,null,null,null,null,null,null,null,null,null,null,null,null,null,null,null,null,null,null,null,null,null,null,null,null,null,null,null,null,null,null,"Hidden cell do not edit",null,null,null,null,null,null,null,null,null,"Hidden"]
["SAP Utility Relocation By Others Begins Date:",null,null,null,"SAP Utility Relocation By Others Complete Date:",null,null,null,null,null,null,"Comments related to PUE and URA",null,null,null,null,null,null,null,null,null,null,null,null,null,null,null,null,null,null,null,null,null,null,null,null,null,null,null,null,null,null,null,null,null,null,null,null,null,null,null,null,null,null,null,null,null,null,null,null,null,null,null,null,null,null,null,null,null,null,null,null,null,null,null,null,null,null,null,null,null,null,null,null,null,null,null,null,null,null,{"$f":"DATE(YEAR(CK13), MONTH(CK13), 1)","v":"1900-01-01"},null,null,null,null,null,null,null,null,"URA","Approved"]
["Moratorium Date Range",null,"Start Date:",null,"Finish Date:",null,null,null,null,null,null,"(Provide information related to PUE and URA status)"]
[]
[]
["Agreements",null,null,null,null,null,null,"Relocation"]
{"$rows_left_out":83}
{"sheet":"Relo Schedule Phase 2","index":3,"n_rows":92,"n_cols":101,"rows_kept":92,"cut":false,"hidden":false,"merged":[[4,2,4,3],[4,5,4,6],[4,7,4,8],[0,3,0,4],[0,5,0,6],[1,11,1,17],[2,11,3,17],[3,2,3,3],[11,15,11,87],[5,0,5,2],[5,4,5,6],[5,11,5,17],[6,0,6,1],[6,11,7,17],[9,0,9,6],[9,7,9,14],[10,1,11,6],[10,7,11,9],[10,10,11,10],[10,11,11,13],[10,14,11,14],[32,39,32,40],[32,15,32,16],[32,17,32,18],[32,19,32,20],[32,21,32,22],[32,23,32,24],[32,25,32,28],[32,29,32,30],[32,31,32,32],[32,33,32,34],[32,35,32,36],[32,37,32,38],[32,63,32,66],[32,67,32,68],[32,41,32,42],[32,43,32,44],[32,45,32,48],[32,49,32,50],[32,51,32,52],[32,53,32,54],[32,83,32,84],[32,85,32,86],[44,25,44,29],[44,45,44,49],[44,63,44,67],[44,79,44,83],[32,69,32,70],[32,71,32,72],[32,73,32,74],[32,75,32,76],[32,77,32,78],[32,79,32,82],[32,55,32,56],[32,57,32,58],[32,59,32,60],[32,61,32,62],[80,64,80,65],[80,80,80,81],[59,4,59,5],[59,11,59,12],[80,9,80,10],[80,13,80,14],[80,27,80,28],[80,47,80,48]]}
[null,"Enter in the highlighted fields",null,"NCDOT Reviewer:",null,null,null,null,null,"V2.0"]
["Let Date:",null,"TIP #:",null,"County:",null,"Division:",{"$f":"IF(F2=\"\",\"\",VLOOKUP(F2,Guidance!B85:C183,2,FALSE))","v":""},null,null,null,"Project Description:"]
[]
["PS&E Date:",null,"Utility Priority Parcels Aquired Date:"]
["Date final PUE due from PEF to DOT:",null,"Date final PUE sent to DOT:",null,null,"PUE received date compared to PUE due date:",null,{"$f":"IF(B5=\"\",\"\",\nIF(E5=B5,\"On time\",\nIF(E5>B5,\n   IF(DATEDIF(B5,E5,\"d\")<=30, DATEDIF(B5,E5,\"d\") & \" days behind schedule\", DATEDIF(B5,E5,\"m\") & \" months behind schedule\"),\n   IF(DATEDIF(E5,B5,\"d\")<=30, DATEDIF(E5,B5,\"d\") & \" days ahead of schedule\", DATEDIF(E5,B5,\"m\") & \" months ahead of schedule\")\n)))","v":""},null,{"$f":"DATEDIF(MIN(B5,E5), MAX(B5,E5), \"m\") * SIGN(E5 - B5)","v":"00:00:00"},null,null,null,null,null,null,null,null,null,null,null,null,null,null,null,null,null,null,null,null,null,null,null,null,null,null,null,null,null,null,null,null,null,null,null,null,null,null,null,null,null,null,null,null,null,null,null,null,null,null,null,null,null,null,null,null,null,null,null,null,null,null,null,null,null,null,null,null,null,null,null,null,null,null,null,null,null,null,null,null,"Hidden cell do not edit",null,null,null,null,null,null,null,null,null,"Hidden"]
["SAP Utility Relocation By Others Begins Date:",null,null,null,"SAP Utility Relocation By Others Complete Date:",null,null,null,null,null,null,"Comments related to PUE and URA",null,null,null,null,null,null,null,null,null,null,null,null,null,null,null,null,null,null,null,null,null,null,null,null,null,null,null,null,null,null,null,null,null,null,null,null,null,null,null,null,null,null,null,null,null,null,null,null,null,null,null,null,null,null,null,null,null,null,null,null,null,null,null,null,null,null,null,null,null,null,null,null,null,null,null,null,null,null,{"$f":"DATE(YEAR(CK13), MONTH(CK13), 1)","v":"1900-01-01"},null,null,null,null,null,null,null,null,"URA","Approved"]
["Moratorium Date Range",null,"Start Date:",null,"Finish Date:",null,null,null,null,null,null,"(Provide information related to PUE and URA status)"]
[]
[]
["Agreements",null,null,null,null,null,null,"Relocation"]
{"$rows_left_out":83}
{"sheet":"Example Parcels","index":4,"n_rows":110,"n_cols":32,"rows_kept":110,"cut":false,"hidden":false,"merged":[[7,5,7,8],[14,0,14,3]]}
["Legend",null,"Acquired",null,null,null,null,null,null,null,null,null,null,null,null,null,null,null,null,null,null,null,null,null,null,null,null,null,null,null,"Acquired","Hidden"]
[null,null,"Waiting to be recorded",null,null,null,null,null,null,null,null,null,null,null,null,null,null,null,null,null,null,null,null,null,null,null,null,null,null,null,"Waiting to be recorded"]
[null,null,"Initial Contact",null,null,null,null,null,null,null,null,null,null,null,null,null,null,null,null,null,null,null,null,null,null,null,null,null,null,null,"Initial Contact"]
[null,null,"On Hold",null,null,null,null,null,null,null,null,null,null,null,null,null,null,null,null,null,null,null,null,null,null,null,null,null,null,null,"On Hold"]
[null,null,"Condemnation",null,null,null,null,null,null,null,null,null,null,null,null,null,null,null,null,null,null,null,null,null,null,null,null,null,null,null,"Condemnation"]
[null,null,"Filed",null,null,null,null,null,null,null,null,null,null,null,null,null,null,null,null,null,null,null,null,null,null,null,null,null,null,null,"Filed"]
[null,null,null,null,null,"Replace \"Utility Owner # \" with actual Utility Owner names"]
["Acquired","Total","% of Parcels Acquired","Acquired Date",null,"If Utility owner is on parcel select them from dropdown"]
[{"$f":"COUNTIF(G11:G110, \"Acquired\")+COUNTIF(G11:G110, \"Filed\")","v":10},{"$f":"SUMPRODUCT(--(MMULT(--(I11:X110<>\"\"),TRANSPOSE(COLUMN(I11:X11)^0))>0))","v":10},{"$f":"IF(B9=0,\"\",A9/B9)","v":1},"2027-01-01"]
[null,null,null,null,null,"Date Acquired","Status","Parcel #","Energy United","Duke Energy","Spectrum","Windstream","Electricities","AT&T","PNG","Segra","Charlotte water","Victory Comm","Lumen","MCNC","Utility owner 13","Utility owner 14","Backflow Preventer"]
{"$rows_left_out":101}
{"sheet":"Example","index":5,"n_rows":92,"n_cols":101,"rows_kept":92,"cut":false,"hidden":false,"merged":[[9,0,9,6],[9,7,9,14],[0,3,0,4],[0,5,0,6],[1,11,1,17],[2,11,3,17],[3,2,3,3],[4,2,4,3],[4,5,4,6],[4,7,4,8],[5,0,5,2],[5,4,5,6],[5,11,5,17],[6,0,6,1],[6,11,7,17],[32,15,32,16],[32,17,32,18],[32,19,32,20],[10,1,11,6],[10,7,11,9],[10,10,11,10],[10,11,11,13],[10,14,11,14],[11,15,11,87],[32,45,32,48],[32,21,32,22],[32,23,32,24],[32,25,32,28],[32,29,32,30],[32,31,32,32],[32,33,32,34],[32,35,32,36],[32,37,32,38],[32,39,32,40],[32,41,32,42],[32,43,32,44],[32,73,32,74],[32,49,32,50],[32,51,32,52],[32,53,32,54],[32,55,32,56],[32,57,32,58],[32,59,32,60],[32,61,32,62],[32,63,32,66],[32,67,32,68],[32,69,32,70],[32,71,32,72],[32,75,32,76],[32,77,32,78],[32,79,32,82],[32,83,32,84],[32,85,32,86],[80,64,80,65],[80,80,80,81],[59,4,59,5],[59,11,59,12],[44,63,44,67],[44,79,44,83],[80,9,80,10],[80,13,80,14],[80,27,80,28],[80,47,80,48],[44,25,44,29],[44,45,44,49]]}
[null,"Enter in the highlighted fields",null,"NCDOT Reviewer:",null,"Dayton Martin",null,null,null,"V2.0"]
["Let Date:","2028-11-04","TIP #:","R-0001","County:","Wake","Division:",{"$f":"IF(F2=\"\",\"\",VLOOKUP(F2,Guidance!B85:C183,2,FALSE))","v":"Div 5"},null,null,null,"Project Description:"]
[null,null,null,null,null,null,null,null,null,null,null,"Replacing Bridge #204 across Century Center river"]
["PS&E Date:","2028-07-11","Utility Priority Parcels Aquired Date:",null,"2027-01-01"]
["Date final PUE due from PEF to DOT:","2025-10-16","Date final PUE sent to DOT:",null,"2025-09-03","PUE received date compared to PUE due date:",null,{"$f":"IF(B5=\"\",\"\",\nIF(E5=B5,\"On time\",\nIF(E5>B5,\n   IF(DATEDIF(B5,E5,\"d\")<=30, DATEDIF(B5,E5,\"d\") & \" days behind schedule\", DATEDIF(B5,E5,\"m\") & \" months behind schedule\"),\n   IF(DATEDIF(E5,B5,\"d\")<=30, DATEDIF(E5,B5,\"d\") & \" days ahead of schedule\", DATEDIF(E5,B5,\"m\") & \" months ahead of schedule\")\n)))","v":"1 months ahead of schedule"},null,{"$f":"DATEDIF(MIN(B5,E5), MAX(B5,E5), \"m\") * SIGN(E5 - B5)","v":-1},null,null,null,null,null,null,null,null,null,null,null,null,null,null,null,null,null,null,null,null,null,null,null,null,null,null,null,null,null,null,null,null,null,null,null,null,null,null,null,null,null,null,null,null,null,null,null,null,null,null,null,null,null,null,null,null,null,null,null,null,null,null,null,null,null,null,null,null,null,null,null,null,null,null,null,null,null,null,null,null,"Hidden cell do not edit",null,null,null,null,null,null,null,null,null,"Hidden"]
["SAP Utility Relocation By Others Begins Date:",null,null,"2026-04-01","SAP Utility Relocation By Others Complete Date:",null,null,"2028-06-01",null,null,null,"Comments related to PUE and URA",null,null,null,null,null,null,null,null,null,null,null,null,null,null,null,null,null,null,null,null,null,null,null,null,null,null,null,null,null,null,null,null,null,null,null,null,null,null,null,null,null,null,null,null,null,null,null,null,null,null,null,null,null,null,null,null,null,null,null,null,null,null,null,null,null,null,null,null,null,null,null,null,null,null,null,null,null,null,{"$f":"DATE(YEAR(CK13), MONTH(CK13), 1)","v":"2026-04-01"},null,null,null,null,null,null,null,null,"URA","Approved"]
["Moratorium Date Range",null,"Start Date:",null,"Finish Date:",null,null,null,null,null,null,"(Provide information related to PUE and URA status)"]
[]
[]
["Agreements",null,null,null,null,null,null,"Relocation"]
{"$rows_left_out":83}
{"sheet":"Appendix","index":6,"n_rows":8,"n_cols":3,"rows_kept":8,"cut":false,"hidden":false,"merged":[]}
[null,"Names","Definition"]
[null,"Relocation Duration (In calendar days)","Before the utility owner confirms the duration the coordinator will enter an estimated duration that can be changed later. Each utility owner must have a duration, preliminary or confirmed."]
[null,"PS&E (Roadway Plans to Cont & Prop)","Plans, Specifications & Estimates - Items that must be turned in 1. All Permits 2. All Agreements (UCA and U&O) 3.UBO plans, UC plans, Special Provisions, Estimates need to be turned in at PS&E, the project cannot LET without these items."]
[null,"SAP URBOB","Utility relocation By Others Begins. The official milestone date. "]
[null,"SAP URBOC","Utility relocation By Others Complete. The official milestone date. "]
[null,"Moratorium Date Range","Period of time that could possibly restrict relocation work ex. Bats, protected bodies of water, CAMA counties, Special events (US Open)."]
[null,"First Utility Relocation Start Date: ","Projected or actual first utility relocation of the project. This shows up at URBOB on the Gantt chart."]
[null,"Final Utility Relocation Complete Date:","Projected or actual final utility relocation of the project. This shows up at URBOC on the Gantt chart."]

{"sheet":"Guidance","index":7,"n_rows":183,"n_cols":3,"rows_kept":183,"cut":false,"hidden":false,"merged":[[25,0,30,10]]}
["Utility Relocation By Others – Status Schedule Process"]
["1. Complete the Status Schedule"]
["Fill out the Utility Relocation By Others Status Schedule for the TIP project, ensuring all information is current. Provide updates in Column C (Agreement Package Comments) and Column Q (Utility Owner Relocation Comments)"]
["2. Send the Schedule to NCDOT for Initial Review"]
["Email the completed schedule to the NCDOT utility lead person assigned to the project one week prior to the monthly project status meeting."]
["3. Receive NCDOT Feedback"]
["NCDOT will review the submitted schedule and provide recommended revisions."]
["4. Revise the Schedule"]
["Make all requested revisions based on NCDOT feedback."]
["5. Naming Conventions"]
{"$rows_left_out":173}